We're Hiring!

OMERO 2.7 install - BUILD FAILED

Having a problem deploying OMERO? Here's a great place to start.
Please note:
You can find examples of server set-ups in use by the OMERO community on this documentation page. If you would like to share details of your deployment to help advise the community, there is a questionnaire which we would very much appreciate you completing.

OMERO 2.7 install - BUILD FAILED

Postby MarkUNSW » Thu Feb 02, 2017 5:36 am

Upgrading OMERO server to version 2.7 on Apple platform, I had been running previous version all last year.

I get the following message along with BUILD FAILED

It looks like it cannot find jgoodies-common;1.7.0!jgoodies-common.jar

Any help?

Mark

digitalembryo:~ markhill$ brew install omero52 --with-nginx --with-cpp
==> Installing omero52 from ome/alt
==> Using Homebrew-provided fortran compiler.
This may be changed by setting the FC environment variable.
==> Downloading http://downloads.openmicroscopy.org/ome ... cts/openmi
Already downloaded: /Users/markhill/Library/Caches/Homebrew/omero52-5.2.7.zip
==> ./build.py -Dice.home=/usr/local/opt/zeroc-ice35 build-all
Last 15 lines from /Users/markhill/Library/Logs/Homebrew/omero52/01.build.py:
:: com.jgoodies#jgoodies-common;1.7.0!jgoodies-common.jar
::::::::::::::::::::::::::::::::::::::::::::::


:: USE VERBOSE OR DEBUG MESSAGE LEVEL FOR MORE DETAILS

BUILD FAILED
/private/tmp/omero52-20170202-4172-8nrwmw/openmicroscopy-5.2.7/build.xml:189: The following error occurred while executing this line:
/private/tmp/omero52-20170202-4172-8nrwmw/openmicroscopy-5.2.7/components/antlib/resources/global.xml:430: The following error occurred while executing this line:
/private/tmp/omero52-20170202-4172-8nrwmw/openmicroscopy-5.2.7/components/tools/build.xml:28: The following error occurred while executing this line:
/private/tmp/omero52-20170202-4172-8nrwmw/openmicroscopy-5.2.7/components/antlib/resources/global.xml:430: The following error occurred while executing this line:
/private/tmp/omero52-20170202-4172-8nrwmw/openmicroscopy-5.2.7/components/antlib/resources/lifecycle.xml:67: impossible to resolve dependencies:
resolve failed - see output for details

Total time: 9 minutes 0 seconds

If reporting this issue please do so at (not Homebrew/brew or Homebrew/core):
https://github.com/ome/homebrew-alt/issues

digitalembryo:~ markhill$
MarkUNSW
 
Posts: 7
Joined: Wed Oct 29, 2014 2:10 am

Re: OMERO 2.7 install - BUILD FAILED

Postby kennethgillen » Thu Feb 02, 2017 10:36 am

Hi Mark,

This appears to be a failure to retrieve dependencies.

Have you tried a second time?

Last 15 lines from /Users/markhill/Library/Logs/Homebrew/omero52/01.build.py:

It would be worth sending us the full log if re-trying is the same.

Best,

Kenny
User avatar
kennethgillen
Team Member
 
Posts: 141
Joined: Mon Nov 05, 2012 3:39 pm

Re: OMERO 2.7 install - BUILD FAILED

Postby MarkUNSW » Thu Feb 02, 2017 11:21 pm

Hi Kenny,

Yes tried a few times Here's todays, I think they have moved the web location for 1.7.0!jgoodies-common.jar, if I knew where I should put the JAR file I could place it locally. M

🍺 /usr/local/Cellar/nginx/1.10.3: 8 files, 980.9K
==> Installing ome/alt/omero52 --with-cpp --with-nginx
==> Using Homebrew-provided fortran compiler.
This may be changed by setting the FC environment variable.
==> Downloading http://downloads.openmicroscopy.org/ome ... cts/openmi
Already downloaded: /Users/markhill/Library/Caches/Homebrew/omero52-5.2.7.zip
==> ./build.py -Dice.home=/usr/local/opt/zeroc-ice35 build-all
Last 15 lines from /Users/markhill/Library/Logs/Homebrew/omero52/01.build.py:
:: com.jgoodies#jgoodies-common;1.7.0!jgoodies-common.jar
::::::::::::::::::::::::::::::::::::::::::::::


:: USE VERBOSE OR DEBUG MESSAGE LEVEL FOR MORE DETAILS

BUILD FAILED
/private/tmp/omero52-20170203-36784-15f4rk5/openmicroscopy-5.2.7/build.xml:189: The following error occurred while executing this line:
/private/tmp/omero52-20170203-36784-15f4rk5/openmicroscopy-5.2.7/components/antlib/resources/global.xml:430: The following error occurred while executing this line:
/private/tmp/omero52-20170203-36784-15f4rk5/openmicroscopy-5.2.7/components/tools/build.xml:28: The following error occurred while executing this line:
/private/tmp/omero52-20170203-36784-15f4rk5/openmicroscopy-5.2.7/components/antlib/resources/global.xml:430: The following error occurred while executing this line:
/private/tmp/omero52-20170203-36784-15f4rk5/openmicroscopy-5.2.7/components/antlib/resources/lifecycle.xml:67: impossible to resolve dependencies:
resolve failed - see output for details

Total time: 9 minutes 0 seconds

If reporting this issue please do so at (not Homebrew/brew or Homebrew/core):
https://github.com/ome/homebrew-alt/issues

digitalembryo:~ markhill$
MarkUNSW
 
Posts: 7
Joined: Wed Oct 29, 2014 2:10 am

Re: OMERO 2.7 install - BUILD FAILED

Postby kennethgillen » Fri Feb 03, 2017 10:42 am

Hi Mark,

Test there is no stale cache hanging around, you could try the following:
Code: Select all
`rm -rf ~/.m2/repository/com/jgoodies && brew install omero52 --with-nginx --with-cpp`


If you're still having problems, could you please send us the full log file?
Code: Select all
/Users/markhill/Library/Logs/Homebrew/omero52/01.build.py

Best,

Kenny
User avatar
kennethgillen
Team Member
 
Posts: 141
Joined: Mon Nov 05, 2012 3:39 pm

Re: OMERO 2.7 install - BUILD FAILED

Postby MarkUNSW » Wed Feb 08, 2017 6:26 am

Hi Kenny,

Thanks for the input, I've been able to complete the installation however I'm receiving a perplexing python error
Python quit unexpectedly while using the Python plug-in.
when executing
Code: Select all
omero web start


My OMERO diagnostics output is as follows:
================================================================================
OMERO Diagnostics 5.2.7-ice35
================================================================================

Commands: java -version 1.8.0 (/usr/bin/java)
Commands: python -V 2.7.13 (/usr/local/bin/python -- 2 others)
Commands: icegridnode --version 3.5.1 (/usr/local/bin/icegridnode)
Commands: icegridadmin --version 3.5.1 (/usr/local/bin/icegridadmin)
Commands: psql --version 9.4.9 (/usr/local/bin/psql -- 2 others)

Server: icegridnode running
Server: Blitz-0 active (pid = 19492, enabled)
Server: DropBox active (pid = 19493, enabled)
Server: FileServer active (pid = 19494, enabled)
Server: Indexer-0 active (pid = 19495, enabled)
Server: MonitorServer active (pid = 19496, enabled)
Server: OMERO.Glacier2 active (pid = 19497, enabled)
Server: OMERO.IceStorm active (pid = 19498, enabled)
Server: PixelData-0 active (pid = 19499, enabled)
Server: Processor-0 active (pid = 19500, enabled)
Server: Tables-0 active (pid = 19501, enabled)
Server: TestDropBox inactive (enabled)

Log dir: /usr/local/Cellar/omero52/5.2.7/var/log exists
Log files: Blitz-0.log 4.0 MB errors=213 warnings=5
Log files: DropBox.log 31.0 KB errors=26 warnings=12
Log files: FileServer.log 4.0 KB
Log files: Indexer-0.log 8.0 MB errors=2760 warnings=545
Log files: MonitorServer.log 11.0 KB errors=16 warnings=0
Log files: OMEROweb.lock 0.0 KB
Log files: OMEROweb.log 3.0 KB errors=0 warnings=12
Log files: OMEROweb_brokenrequest.lock 0.0 KB
Log files: OMEROweb_brokenrequest.log 0.0 KB
Log files: PixelData-0.log 4.0 MB errors=1395 warnings=272
Log files: Processor-0.log 496.0 KB errors=160 warnings=24
Log files: Tables-0.log 36.0 KB errors=27 warnings=12
Log files: TestDropBox.log n/a
Log files: master.err 0.0 KB errors=0 warnings=6
Log files: master.out 0.0 KB
Log files: nginx_access.log 0.0 KB
Log files: nginx_error.log 0.0 KB
Log files: Total size 18.59 MB


Environment:OMERO_HOME=(unset)
Environment:OMERO_NODE=(unset)
Environment:OMERO_MASTER=(unset)
Environment:OMERO_USERDIR=(unset)
Environment:OMERO_TMPDIR=(unset)
Environment:PATH=/usr/local/bin:/usr/bin:/bin:/usr/sbin:/sbin:/Applications/Server.app/Contents/ServerRoot/usr/bin:/Applications/Server.app/Contents/ServerRoot/usr/sbin
Environment:PYTHONPATH=/usr/local/opt/omero52/lib/python
Environment:ICE_HOME=(unset)
Environment:LD_LIBRARY_PATH=(unset)
Environment:DYLD_LIBRARY_PATH=(unset)

OMERO SSL port:4064
OMERO TCP port:4063
OMERO data dir:'/Volumes/DEC01/OMERO.data' Exists? True Is writable? True
OMERO temp dir:'/Users/markhill/omero/tmp' Exists? True Is writable? True (Size: 12296)

JVM settings: Blitz-${index} -Xmx1932m -XX:MaxPermSize=1g -XX:+IgnoreUnrecognizedVMOptions
JVM settings: Indexer-${index} -Xmx1288m -XX:MaxPermSize=1g -XX:+IgnoreUnrecognizedVMOptions
JVM settings: PixelData-${index} -Xmx1932m -XX:MaxPermSize=1g -XX:+IgnoreUnrecognizedVMOptions
JVM settings: Repository-${index} -Xmx1288m -XX:MaxPermSize=1g -XX:+IgnoreUnrecognizedVMOptions

OMERO.web status... [RUNNING] (PID 20613)
Django version: 1.8


var/log/master.err:
-! 02/08/17 17:01:24.267 warning: unknown property: `IceSSL.ProtocolVersionMax'


var/log/OMEROweb.log:
2017-02-08 06:18:27,240 WARNI [ py.warnings] (proc.20605) <module>():9 /usr/local/opt/omero52/lib/python/pipeline/utils.py:11: RemovedInDjango19Warning: django.utils.importlib will be removed in Django 1.9.
from django.utils import importlib


The error diagnostic report:
Process: Python [19790]
Path: /System/Library/Frameworks/Python.framework/Versions/2.7/Resources/Python.app/Contents/MacOS/Python
Identifier: Python
Version: 2.7.10 (2.7.10)
Code Type: X86-64 (Native)
Parent Process: Python [19552]
Responsible: Python [19790]
User ID: 501

PlugIn Path: /usr/local/opt/python/Frameworks/Python.framework/Versions/2.7/Python
PlugIn Identifier: org.python.python
PlugIn Version: 2.7.13, [c] 2001-2016 Python Software Foundation. (2.7.13)

Date/Time: 2017-02-08 17:02:15.256 +1100
OS Version: Mac OS X 10.12.3 (16D32)
Report Version: 12
Anonymous UUID: 8C420089-D8A6-95BF-2C8F-D50017ED14D4


Time Awake Since Boot: 3700 seconds

System Integrity Protection: enabled

Crashed Thread: 0 Dispatch queue: com.apple.main-thread

Exception Type: EXC_CRASH (SIGABRT)
Exception Codes: 0x0000000000000000, 0x0000000000000000
Exception Note: EXC_CORPSE_NOTIFY

Application Specific Information:
crashed on child side of fork pre-exec

Thread 0 Crashed:: Dispatch queue: com.apple.main-thread
0 libsystem_kernel.dylib 0x00007fffe06a9dd6 __pthread_kill + 10
1 libsystem_pthread.dylib 0x00007fffe0795787 pthread_kill + 90
2 libsystem_c.dylib 0x00007fffe060f4bb __abort + 140
3 libsystem_c.dylib 0x00007fffe060f42f abort + 144
4 org.python.python 0x000000010423f2c6 Py_FatalError + 49
5 org.python.python 0x000000010423e870 PyThreadState_Get + 28
6 org.python.python 0x000000010423b5da Py_InitModule4_64 + 62
7 IcePy.so 0x0000000103b5d94d initIcePy + 45
8 org.python.python 0x00000001029f4190 _PyImport_LoadDynamicModule + 140
9 org.python.python 0x00000001029f2e8c 0x102959000 + 630412
10 org.python.python 0x00000001029f2a60 0x102959000 + 629344
11 org.python.python 0x00000001029f1c38 PyImport_ImportModuleLevel + 1129
12 org.python.python 0x00000001029d7066 0x102959000 + 516198
13 org.python.python 0x000000010296375b PyObject_Call + 99
14 org.python.python 0x00000001029e1e1b PyEval_CallObjectWithKeywords + 165
15 org.python.python 0x00000001029ddc6f PyEval_EvalFrameEx + 8283
16 org.python.python 0x00000001029dba1e PyEval_EvalCodeEx + 1617
17 org.python.python 0x00000001029db3c7 PyEval_EvalCode + 48
18 org.python.python 0x00000001029f071d PyImport_ExecCodeModuleEx + 241
19 org.python.python 0x00000001029f3427 0x102959000 + 631847
20 org.python.python 0x00000001029f2e8c 0x102959000 + 630412
21 org.python.python 0x00000001029f2aa1 0x102959000 + 629409
22 org.python.python 0x00000001029f1c38 PyImport_ImportModuleLevel + 1129
23 org.python.python 0x00000001029d7066 0x102959000 + 516198
24 org.python.python 0x000000010296375b PyObject_Call + 99
25 org.python.python 0x00000001029e1e1b PyEval_CallObjectWithKeywords + 165
26 org.python.python 0x00000001029ddc6f PyEval_EvalFrameEx + 8283
27 org.python.python 0x00000001029dba1e PyEval_EvalCodeEx + 1617
28 org.python.python 0x00000001029db3c7 PyEval_EvalCode + 48
29 org.python.python 0x00000001029f071d PyImport_ExecCodeModuleEx + 241
30 org.python.python 0x00000001029f3427 0x102959000 + 631847
31 org.python.python 0x00000001029f36af 0x102959000 + 632495
32 org.python.python 0x00000001029f2e8c 0x102959000 + 630412
33 org.python.python 0x00000001029f2aa1 0x102959000 + 629409
34 org.python.python 0x00000001029f1c38 PyImport_ImportModuleLevel + 1129
35 org.python.python 0x00000001029d7066 0x102959000 + 516198
36 org.python.python 0x000000010296375b PyObject_Call + 99
37 org.python.python 0x00000001029e1e1b PyEval_CallObjectWithKeywords + 165
38 org.python.python 0x00000001029ddc6f PyEval_EvalFrameEx + 8283
39 org.python.python 0x00000001029dba1e PyEval_EvalCodeEx + 1617
40 org.python.python 0x00000001029db3c7 PyEval_EvalCode + 48
41 org.python.python 0x00000001029f071d PyImport_ExecCodeModuleEx + 241
42 org.python.python 0x00000001029f3427 0x102959000 + 631847
43 org.python.python 0x00000001029f2e8c 0x102959000 + 630412
44 org.python.python 0x00000001029f2a60 0x102959000 + 629344
45 org.python.python 0x00000001029f1c70 PyImport_ImportModuleLevel + 1185
46 org.python.python 0x00000001029d7066 0x102959000 + 516198
47 org.python.python 0x00000001029df534 PyEval_EvalFrameEx + 14624
48 org.python.python 0x00000001029dba1e PyEval_EvalCodeEx + 1617
49 org.python.python 0x00000001029e2442 0x102959000 + 562242
50 org.python.python 0x00000001029deeae PyEval_EvalFrameEx + 12954
51 org.python.python 0x00000001029dba1e PyEval_EvalCodeEx + 1617
52 org.python.python 0x0000000102981531 0x102959000 + 165169
53 org.python.python 0x000000010296375b PyObject_Call + 99
54 org.python.python 0x000000010296e40c 0x102959000 + 87052
55 org.python.python 0x000000010296375b PyObject_Call + 99
56 org.python.python 0x00000001029aa283 0x102959000 + 332419
57 org.python.python 0x00000001029a5ad8 0x102959000 + 314072
58 org.python.python 0x000000010296375b PyObject_Call + 99
59 org.python.python 0x00000001029de7eb PyEval_EvalFrameEx + 11223
60 org.python.python 0x00000001029dba1e PyEval_EvalCodeEx + 1617
61 org.python.python 0x00000001029e2442 0x102959000 + 562242
62 org.python.python 0x00000001029deeae PyEval_EvalFrameEx + 12954
63 org.python.python 0x00000001029dba1e PyEval_EvalCodeEx + 1617
64 org.python.python 0x0000000102981531 0x102959000 + 165169
65 org.python.python 0x000000010296375b PyObject_Call + 99
66 org.python.python 0x000000010296e40c 0x102959000 + 87052
67 org.python.python 0x000000010296375b PyObject_Call + 99
68 org.python.python 0x000000010295fe46 PyObject_CallFunctionObjArgs + 190
69 org.python.python 0x00000001029aca27 0x102959000 + 342567
70 org.python.python 0x00000001029a9a2d 0x102959000 + 330285
71 org.python.python 0x00000001029ddb62 PyEval_EvalFrameEx + 8014
72 org.python.python 0x00000001029e24d5 0x102959000 + 562389
73 org.python.python 0x00000001029deeae PyEval_EvalFrameEx + 12954
74 org.python.python 0x00000001029e24d5 0x102959000 + 562389
75 org.python.python 0x00000001029deeae PyEval_EvalFrameEx + 12954
76 org.python.python 0x00000001029dba1e PyEval_EvalCodeEx + 1617
77 org.python.python 0x00000001029db3c7 PyEval_EvalCode + 48
78 org.python.python 0x00000001029f071d PyImport_ExecCodeModuleEx + 241
79 org.python.python 0x00000001029f3427 0x102959000 + 631847
80 org.python.python 0x00000001029f2e8c 0x102959000 + 630412
81 org.python.python 0x00000001029f2a60 0x102959000 + 629344
82 org.python.python 0x00000001029f1c70 PyImport_ImportModuleLevel + 1185
83 org.python.python 0x00000001029d7066 0x102959000 + 516198
84 org.python.python 0x00000001029df534 PyEval_EvalFrameEx + 14624
85 org.python.python 0x00000001029dba1e PyEval_EvalCodeEx + 1617
86 org.python.python 0x00000001029e2442 0x102959000 + 562242
87 org.python.python 0x00000001029deeae PyEval_EvalFrameEx + 12954
88 org.python.python 0x00000001029e24d5 0x102959000 + 562389
89 org.python.python 0x00000001029deeae PyEval_EvalFrameEx + 12954
90 org.python.python 0x00000001029e24d5 0x102959000 + 562389
91 org.python.python 0x00000001029deeae PyEval_EvalFrameEx + 12954
92 org.python.python 0x00000001029dba1e PyEval_EvalCodeEx + 1617
93 org.python.python 0x00000001029e2442 0x102959000 + 562242
94 org.python.python 0x00000001029deeae PyEval_EvalFrameEx + 12954
95 org.python.python 0x00000001029e24d5 0x102959000 + 562389
96 org.python.python 0x00000001029deeae PyEval_EvalFrameEx + 12954
97 org.python.python 0x00000001029dba1e PyEval_EvalCodeEx + 1617
98 org.python.python 0x00000001029e2442 0x102959000 + 562242
99 org.python.python 0x00000001029deeae PyEval_EvalFrameEx + 12954
100 org.python.python 0x00000001029dba1e PyEval_EvalCodeEx + 1617
101 org.python.python 0x00000001029e2442 0x102959000 + 562242
102 org.python.python 0x00000001029deeae PyEval_EvalFrameEx + 12954
103 org.python.python 0x00000001029dba1e PyEval_EvalCodeEx + 1617
104 org.python.python 0x00000001029e2442 0x102959000 + 562242
105 org.python.python 0x00000001029deeae PyEval_EvalFrameEx + 12954
106 org.python.python 0x00000001029dba1e PyEval_EvalCodeEx + 1617
107 org.python.python 0x00000001029e2442 0x102959000 + 562242
108 org.python.python 0x00000001029deeae PyEval_EvalFrameEx + 12954
109 org.python.python 0x00000001029dba1e PyEval_EvalCodeEx + 1617
110 org.python.python 0x00000001029e2442 0x102959000 + 562242
111 org.python.python 0x00000001029deeae PyEval_EvalFrameEx + 12954
112 org.python.python 0x00000001029dba1e PyEval_EvalCodeEx + 1617
113 org.python.python 0x00000001029e2442 0x102959000 + 562242
114 org.python.python 0x00000001029deeae PyEval_EvalFrameEx + 12954
115 org.python.python 0x00000001029dba1e PyEval_EvalCodeEx + 1617
116 org.python.python 0x00000001029e2442 0x102959000 + 562242
117 org.python.python 0x00000001029deeae PyEval_EvalFrameEx + 12954
118 org.python.python 0x00000001029e24d5 0x102959000 + 562389
119 org.python.python 0x00000001029deeae PyEval_EvalFrameEx + 12954
120 org.python.python 0x00000001029dba1e PyEval_EvalCodeEx + 1617
121 org.python.python 0x00000001029db3c7 PyEval_EvalCode + 48
122 org.python.python 0x00000001029fb63d 0x102959000 + 665149
123 org.python.python 0x00000001029fb6e0 PyRun_FileExFlags + 133
124 org.python.python 0x00000001029fb231 PyRun_SimpleFileExFlags + 702
125 org.python.python 0x0000000102a0cbca Py_Main + 3094
126 libdyld.dylib 0x00007fffe057b255 start + 1

Thread 0 crashed with X86 Thread State (64-bit):
rax: 0x0000000000000000 rbx: 0x0000000000000006 rcx: 0x00007fff5d2aae48 rdx: 0x0000000000000000
rdi: 0x0000000000000203 rsi: 0x0000000000000006 rbp: 0x00007fff5d2aae70 rsp: 0x00007fff5d2aae48
r8: 0x0000000000000000 r9: 0x0000000000989680 r10: 0x0000000008000000 r11: 0x0000000000000206
r12: 0x00007fe1ce82b600 r13: 0x0000000103bcfa8a r14: 0x00007fffe93c33c0 r15: 0x0000000102a91478
rip: 0x00007fffe06a9dd6 rfl: 0x0000000000000206 cr2: 0x00000001038ce020

Logical CPU: 0
Error Code: 0x02000148
Trap Number: 133


Binary Images:
0x102950000 - 0x102950fff org.python.python (2.7.10 - 2.7.10) <41B95001-0416-37B7-A52A-CCDD43B634FB> /System/Library/Frameworks/Python.framework/Versions/2.7/Resources/Python.app/Contents/MacOS/Python
0x102959000 - 0x102a4afff org.python.python (2.7.10 - 2.7.10) <92A4E40A-8B83-3F5F-B5F8-62587FE2EE4C> /System/Library/Frameworks/Python.framework/Versions/2.7/Python
0x102ba2000 - 0x102ba6ff3 _json.so (97) <F30CA32D-6670-3C70-BC9F-5D2265195387> /System/Library/Frameworks/Python.framework/Versions/2.7/lib/python2.7/lib-dynload/_json.so
0x102bac000 - 0x102bacfff _bisect.so (97) <DA35D745-0775-3DED-A7D8-78EB6379F15E> /System/Library/Frameworks/Python.framework/Versions/2.7/lib/python2.7/lib-dynload/_bisect.so
0x102bb1000 - 0x102bb5fff array.so (97) <5C21A9AC-1BCC-3DD7-BEE4-F348560B553D> /System/Library/Frameworks/Python.framework/Versions/2.7/lib/python2.7/lib-dynload/array.so
0x102c13000 - 0x102c14fff _locale.so (97) <A3C07659-A612-385D-8460-9925FAC7E877> /System/Library/Frameworks/Python.framework/Versions/2.7/lib/python2.7/lib-dynload/_locale.so
0x102c99000 - 0x102c9afff _functools.so (97) <C98A98D6-F8AA-31E8-AEBB-1CF609FEA91B> /System/Library/Frameworks/Python.framework/Versions/2.7/lib/python2.7/lib-dynload/_functools.so
0x102c9f000 - 0x102ca2fff operator.so (97) <3071A366-6F3E-3139-A22A-ED56C413A982> /System/Library/Frameworks/Python.framework/Versions/2.7/lib/python2.7/lib-dynload/operator.so
0x102ce9000 - 0x102cecfff strop.so (97) <2E1C128D-03C2-3DE8-ACEB-BFEF81AD9EE1> /System/Library/Frameworks/Python.framework/Versions/2.7/lib/python2.7/lib-dynload/strop.so
0x102cf2000 - 0x102cf9fff _socket.so (97) <5BFEFF09-8EE4-39F7-A8CB-804CBE7862B9> /System/Library/Frameworks/Python.framework/Versions/2.7/lib/python2.7/lib-dynload/_socket.so
0x102d04000 - 0x102d0dfff _ssl.so (97) <1EDB59E7-8DC8-3957-8B3B-8840231718D7> /System/Library/Frameworks/Python.framework/Versions/2.7/lib/python2.7/lib-dynload/_ssl.so
0x102d19000 - 0x102d1afff cStringIO.so (97) <FF27E6A0-AECE-32B3-AD70-226FBC315BB9> /System/Library/Frameworks/Python.framework/Versions/2.7/lib/python2.7/lib-dynload/cStringIO.so
0x102d20000 - 0x102d21ffb time.so (97) <2D302DAB-C9A4-3019-B031-5D9E6FDF9920> /System/Library/Frameworks/Python.framework/Versions/2.7/lib/python2.7/lib-dynload/time.so
0x102d28000 - 0x102d2bffb _struct.so (97) <ABCAF3AD-5239-3E35-852F-98A1A15E3698> /System/Library/Frameworks/Python.framework/Versions/2.7/lib/python2.7/lib-dynload/_struct.so
0x102d32000 - 0x102d34ff3 binascii.so (97) <5B85CC2F-621B-35B9-865F-13FCC6206303> /System/Library/Frameworks/Python.framework/Versions/2.7/lib/python2.7/lib-dynload/binascii.so
0x102d79000 - 0x102d7bff7 _collections.so (97) <17BA1571-9D69-3B61-A5EB-3436A34F797C> /System/Library/Frameworks/Python.framework/Versions/2.7/lib/python2.7/lib-dynload/_collections.so
0x102d82000 - 0x102d86fff itertools.so (97) <FB4A82FA-AF6F-3DE7-BE07-054100BED439> /System/Library/Frameworks/Python.framework/Versions/2.7/lib/python2.7/lib-dynload/itertools.so
0x102d90000 - 0x102d91fff _heapq.so (97) <BB487570-83C9-3A2B-A861-9F40E77CE535> /System/Library/Frameworks/Python.framework/Versions/2.7/lib/python2.7/lib-dynload/_heapq.so
0x102dd7000 - 0x102dd7fff _scproxy.so (97) <46C34814-93CE-38C2-AFB2-C61A50F8F113> /System/Library/Frameworks/Python.framework/Versions/2.7/lib/python2.7/lib-dynload/_scproxy.so
0x102ddc000 - 0x102ddeffb select.so (97) <8C1660A5-A86E-3908-A886-59F9EEB14B36> /System/Library/Frameworks/Python.framework/Versions/2.7/lib/python2.7/lib-dynload/select.so
0x102de5000 - 0x102de8ff7 math.so (97) <ECF73D21-74B5-350E-AEAE-55B79C32E004> /System/Library/Frameworks/Python.framework/Versions/2.7/lib/python2.7/lib-dynload/math.so
0x102eaf000 - 0x102eb0fff _hashlib.so (97) <09EAC735-94A2-3BAE-835A-01D00B8A2DB6> /System/Library/Frameworks/Python.framework/Versions/2.7/lib/python2.7/lib-dynload/_hashlib.so
0x102eb6000 - 0x102eb7fff _random.so (97) <FB20DCD0-6321-3D5F-BA5A-5A403E12B8A2> /System/Library/Frameworks/Python.framework/Versions/2.7/lib/python2.7/lib-dynload/_random.so
0x102efc000 - 0x102f05ff3 datetime.so (97) <6E26EFC1-5ED3-3FBB-B7A3-723EC934FB10> /System/Library/Frameworks/Python.framework/Versions/2.7/lib/python2.7/lib-dynload/datetime.so
0x102f0f000 - 0x102f10fff fcntl.so (97) <0B4F33D1-8D44-3F3C-85BB-94226C41ACFE> /System/Library/Frameworks/Python.framework/Versions/2.7/lib/python2.7/lib-dynload/fcntl.so
0x102f15000 - 0x102f15fff grp.so (97) <41B7269C-407E-3056-862A-1F5FBB11D4F3> /System/Library/Frameworks/Python.framework/Versions/2.7/lib/python2.7/lib-dynload/grp.so
0x102f1a000 - 0x102f29ffb _io.so (97) <22E9508E-066B-3879-985D-B289652655FB> /System/Library/Frameworks/Python.framework/Versions/2.7/lib/python2.7/lib-dynload/_io.so
0x102fbb000 - 0x102fbdfff zlib.so (97) <E74988C7-C2E4-32DC-8CAC-53855828549B> /System/Library/Frameworks/Python.framework/Versions/2.7/lib/python2.7/lib-dynload/zlib.so
0x10323d000 - 0x103242ffb pyexpat.so (97) <33E4752E-44FB-3CE2-B3F7-829FA1C52A95> /System/Library/Frameworks/Python.framework/Versions/2.7/lib/python2.7/lib-dynload/pyexpat.so
0x10324a000 - 0x103263ffb libexpat.1.dylib (15) <617B8B7A-A0AB-37D6-AFCA-F90F7F14E455> /usr/lib/libexpat.1.dylib
0x1033ad000 - 0x1033aeffb resource.so (97) <3AC11103-62A1-303B-BA10-93797462ECA1> /System/Library/Frameworks/Python.framework/Versions/2.7/lib/python2.7/lib-dynload/resource.so
0x1033f3000 - 0x1033feffb cPickle.so (97) <0E0C9051-E1BA-3DC9-AE62-0986D368315E> /System/Library/Frameworks/Python.framework/Versions/2.7/lib/python2.7/lib-dynload/cPickle.so
0x103405000 - 0x103413ffb _ctypes.so (97) <6EDDA1BC-F538-35DC-AF0B-D21A3CF1F66E> /System/Library/Frameworks/Python.framework/Versions/2.7/lib/python2.7/lib-dynload/_ctypes.so
0x103560000 - 0x103604ff3 unicodedata.so (97) <ACF670ED-DB07-39C5-9EDE-C019C50F0514> /System/Library/Frameworks/Python.framework/Versions/2.7/lib/python2.7/lib-dynload/unicodedata.so
0x103b4c000 - 0x103bd6fff +IcePy.so (0) <0CD41D4D-9FDA-3AF5-BD47-A34F8D7BD96C> /usr/local/lib/python2.7/site-packages/IcePy.so
0x103c2b000 - 0x103e4aff3 +libIce.35.dylib (0) <DECD5972-EA72-352C-B0C9-CC6B6541E77E> /usr/local/Cellar/zeroc-ice35/3.5.1_1/lib/libIce.35.dylib
0x103fbd000 - 0x104112ffb +libSlice.35.dylib (0) <26DCBF04-FE45-3095-9D57-88BF9E316E56> /usr/local/Cellar/zeroc-ice35/3.5.1_1/lib/libSlice.35.dylib
0x104158000 - 0x10417cff3 +libIceUtil.35.dylib (0) <8BF7DF4F-9C30-38F8-89A2-A193C8D10856> /usr/local/Cellar/zeroc-ice35/3.5.1_1/lib/libIceUtil.35.dylib
0x104199000 - 0x10428fff7 +org.python.python (2.7.13, [c] 2001-2016 Python Software Foundation. - 2.7.13) <4FBE16EB-7083-3358-B64B-C7D1D7121ADC> /usr/local/opt/python/Frameworks/Python.framework/Versions/2.7/Python
0x104321000 - 0x104339ff7 +libmcpp.0.dylib (0) <F8966F98-C0DF-3ACA-BDE9-B9B742651FD8> /usr/local/opt/mcpp/lib/libmcpp.0.dylib
0x104624000 - 0x104661267 dyld (421.2) <947FC440-80F9-32F7-A773-6FC418FE1AB7> /usr/lib/dyld
0x7fffcaefa000 - 0x7fffcb38eff7 com.apple.CoreFoundation (6.9 - 1348.28) <0F1FAA52-1C06-327E-A170-382B48B1846D> /System/Library/Frameworks/CoreFoundation.framework/Versions/A/CoreFoundation
0x7fffccef7000 - 0x7fffccf8cff7 com.apple.framework.IOKit (2.0.2 - 1324.30.13) <163BE7FA-B29A-348F-8B5F-E301F2E8C964> /System/Library/Frameworks/IOKit.framework/Versions/A/IOKit
0x7fffd141e000 - 0x7fffd173dfff com.apple.security (7.0 - 57740.31.2) <A47D7BAE-0591-3184-8E44-FB2EB08A19C2> /System/Library/Frameworks/Security.framework/Versions/A/Security
0x7fffd1b68000 - 0x7fffd1bd9ff7 com.apple.SystemConfiguration (1.14 - 1.14) <D9A57D90-E54F-3E1A-AA2F-F5A694BCE4BB> /System/Library/Frameworks/SystemConfiguration.framework/Versions/A/SystemConfiguration
0x7fffdda60000 - 0x7fffdda61fff com.apple.TrustEvaluationAgent (2.0 - 28) <07C1F711-A1E0-3BAC-8F4D-977516D50925> /System/Library/PrivateFrameworks/TrustEvaluationAgent.framework/Versions/A/TrustEvaluationAgent
0x7fffded22000 - 0x7fffded23ff3 libDiagnosticMessagesClient.dylib (102) <422911A4-E273-3E88-BFC4-DF6470E48242> /usr/lib/libDiagnosticMessagesClient.dylib
0x7fffdef5b000 - 0x7fffdef5bfff libOpenScriptingUtil.dylib (172) <D025E180-BB3B-3FFA-98FC-B6835354D723> /usr/lib/libOpenScriptingUtil.dylib
0x7fffdef61000 - 0x7fffdef62ff3 libSystem.B.dylib (1238) <9CB018AF-54E9-300F-82BE-81FE553C9154> /usr/lib/libSystem.B.dylib
0x7fffdf0f3000 - 0x7fffdf0f3ff3 libauto.dylib (187) <5BBF6A00-CC76-389D-84E7-CA88EDADE683> /usr/lib/libauto.dylib
0x7fffdf0f4000 - 0x7fffdf104ff3 libbsm.0.dylib (34) <20084796-B04D-3B35-A003-EA11459557A9> /usr/lib/libbsm.0.dylib
0x7fffdf105000 - 0x7fffdf113ff7 libbz2.1.0.dylib (38) <6FD3B63F-0F86-3A25-BD5B-E243F58792C9> /usr/lib/libbz2.1.0.dylib
0x7fffdf114000 - 0x7fffdf16aff7 libc++.1.dylib (307.4) <BEE86868-F831-384C-919E-2B286ACFE87C> /usr/lib/libc++.1.dylib
0x7fffdf16b000 - 0x7fffdf195fff libc++abi.dylib (307.2) <1CEF8ABB-7E6D-3C2F-8E0A-E7884478DD23> /usr/lib/libc++abi.dylib
0x7fffdf1bd000 - 0x7fffdf1bdff7 libcoretls.dylib (121.31.1) <BCC32537-4831-3E9F-876E-8C9F4CF52FD3> /usr/lib/libcoretls.dylib
0x7fffdf1be000 - 0x7fffdf1bfff3 libcoretls_cfhelpers.dylib (121.31.1) <6F37C5AD-7999-3D31-A52F-7AEED935F32D> /usr/lib/libcoretls_cfhelpers.dylib
0x7fffdf279000 - 0x7fffdf35eff7 libcrypto.0.9.8.dylib (64.30.2) <D41E1901-06DD-3860-BB4F-B3ACE0284C01> /usr/lib/libcrypto.0.9.8.dylib
0x7fffdf5ca000 - 0x7fffdf5cafff libenergytrace.dylib (15) <A1B040A2-7977-3097-9ADF-34FF181EB970> /usr/lib/libenergytrace.dylib
0x7fffdf5d8000 - 0x7fffdf5d9fff libffi.dylib (18.1) <49D03682-E111-351C-8266-4519B3B82BE9> /usr/lib/libffi.dylib
0x7fffdf5e0000 - 0x7fffdf6d2ff7 libiconv.2.dylib (50) <42125B35-81D7-3FC4-9475-A26DBE10884D> /usr/lib/libiconv.2.dylib
0x7fffdf6d3000 - 0x7fffdf8f8ffb libicucore.A.dylib (57149.0.1) <6B5FDA93-AA88-318F-9608-C2A33D602EC7> /usr/lib/libicucore.A.dylib
0x7fffdf900000 - 0x7fffdf919ffb liblzma.5.dylib (10) <44BD0279-99DD-36B5-8A6E-C11432E2098D> /usr/lib/liblzma.5.dylib
0x7fffdfc0b000 - 0x7fffdfc84ff7 libnetwork.dylib (856.30.16) <66C6E4D6-B39C-3309-80C1-CBBE170DDD51> /usr/lib/libnetwork.dylib
0x7fffdfc85000 - 0x7fffe005a127 libobjc.A.dylib (706) <47104A1B-13E8-369F-BC36-27FF465809FD> /usr/lib/libobjc.A.dylib
0x7fffe005d000 - 0x7fffe0061fff libpam.2.dylib (21.30.1) <71EB0D88-DE84-3C8D-A2C5-58AA282BC5BC> /usr/lib/libpam.2.dylib
0x7fffe0062000 - 0x7fffe0092ff7 libpcap.A.dylib (67) <450DB888-2C0C-3085-A5F1-69324DFE902C> /usr/lib/libpcap.A.dylib
0x7fffe011c000 - 0x7fffe025dfff libsqlite3.dylib (253) <AECBC92F-FF00-3369-8ECB-AE053B3578B8> /usr/lib/libsqlite3.dylib
0x7fffe0280000 - 0x7fffe02b8ff3 libssl.0.9.8.dylib (64.30.2) <6E690FB1-A581-3027-93B3-060D9D497A27> /usr/lib/libssl.0.9.8.dylib
0x7fffe0352000 - 0x7fffe035ffff libxar.1.dylib (357) <58BFB84B-66FE-3299-AA3D-BBA178ADEE39> /usr/lib/libxar.1.dylib
0x7fffe0363000 - 0x7fffe0452ffb libxml2.2.dylib (30.11) <E12AF929-0FA5-3214-840F-C81E6AC9F36E> /usr/lib/libxml2.2.dylib
0x7fffe047d000 - 0x7fffe048eff3 libz.1.dylib (67) <46E3FFA2-4328-327A-8D34-A03E20BFFB8E> /usr/lib/libz.1.dylib
0x7fffe049d000 - 0x7fffe04a1ff7 libcache.dylib (79) <0C8092D3-600F-3ADD-A036-F225B6CDCA43> /usr/lib/system/libcache.dylib
0x7fffe04a2000 - 0x7fffe04adff7 libcommonCrypto.dylib (60092.30.2) <B16E29B6-EC8D-3A8F-9A89-DD9CF35F7C4B> /usr/lib/system/libcommonCrypto.dylib
0x7fffe04ae000 - 0x7fffe04b5fff libcompiler_rt.dylib (62) <E992E8D9-037C-3454-A366-A25E4D31D6BB> /usr/lib/system/libcompiler_rt.dylib
0x7fffe04b6000 - 0x7fffe04befff libcopyfile.dylib (138) <64E285D9-5485-333B-AEE7-8B0C8FB9275F> /usr/lib/system/libcopyfile.dylib
0x7fffe04bf000 - 0x7fffe0542fdf libcorecrypto.dylib (442.30.20) <2074B932-FD79-30A9-8E90-AF25C49F2AF1> /usr/lib/system/libcorecrypto.dylib
0x7fffe0543000 - 0x7fffe0575fff libdispatch.dylib (703.30.5) <EA0CC14E-D559-3802-B4B2-0E8C7579AAC4> /usr/lib/system/libdispatch.dylib
0x7fffe0576000 - 0x7fffe057bff3 libdyld.dylib (421.2) <6F506653-FFF6-3DB8-84F1-109AE3C52F32> /usr/lib/system/libdyld.dylib
0x7fffe057c000 - 0x7fffe057cffb libkeymgr.dylib (28) <1A318923-1200-3B06-B432-5007D82F195D> /usr/lib/system/libkeymgr.dylib
0x7fffe057d000 - 0x7fffe0589ffb libkxld.dylib (3789.41.3) <87550136-9353-348B-9CD9-C342B48C5AAF> /usr/lib/system/libkxld.dylib
0x7fffe058a000 - 0x7fffe058afff liblaunch.dylib (972.30.7) <15FACC21-079A-3BDF-9AFB-4253EFDEB587> /usr/lib/system/liblaunch.dylib
0x7fffe058b000 - 0x7fffe0590fff libmacho.dylib (894) <A2F38EC1-C37C-3B93-B0E4-36B07C177F8C> /usr/lib/system/libmacho.dylib
0x7fffe0591000 - 0x7fffe0593ff3 libquarantine.dylib (85) <C1D7749F-5F5F-3BB9-BEFC-1F0B9DA941FD> /usr/lib/system/libquarantine.dylib
0x7fffe0594000 - 0x7fffe0595ffb libremovefile.dylib (45) <CD42974E-BE0B-39FC-9BFC-8A7540A04DC6> /usr/lib/system/libremovefile.dylib
0x7fffe0596000 - 0x7fffe05aeff7 libsystem_asl.dylib (349.30.2) <EFAC72D7-CB13-3DF7-ADF3-EC6635C6F1EA> /usr/lib/system/libsystem_asl.dylib
0x7fffe05af000 - 0x7fffe05afff7 libsystem_blocks.dylib (67) <B8C3701D-5A91-3D35-999D-2DC8D5393525> /usr/lib/system/libsystem_blocks.dylib
0x7fffe05b0000 - 0x7fffe063dfef libsystem_c.dylib (1158.30.7) <2F881962-03CB-3B9D-A782-D98C1BBA4E3D> /usr/lib/system/libsystem_c.dylib
0x7fffe063e000 - 0x7fffe0641ffb libsystem_configuration.dylib (888.30.2) <4FE3983C-E4ED-3939-A578-03AD29C99788> /usr/lib/system/libsystem_configuration.dylib
0x7fffe0642000 - 0x7fffe0645fff libsystem_coreservices.dylib (41.4) <1A572B9E-0C47-320F-8C64-7990D0A5FB5A> /usr/lib/system/libsystem_coreservices.dylib
0x7fffe0646000 - 0x7fffe065eff3 libsystem_coretls.dylib (121.31.1) <4676F06D-274D-31BE-B61C-4D7A4AEF4858> /usr/lib/system/libsystem_coretls.dylib
0x7fffe065f000 - 0x7fffe0665fff libsystem_dnssd.dylib (765.30.11) <DC708D84-ED7D-3936-B996-A67C66B8DDAA> /usr/lib/system/libsystem_dnssd.dylib
0x7fffe0666000 - 0x7fffe068fff7 libsystem_info.dylib (503.30.1) <9ED9121C-F111-3FAD-BC2F-C95DEE1C9362> /usr/lib/system/libsystem_info.dylib
0x7fffe0690000 - 0x7fffe06b2ff7 libsystem_kernel.dylib (3789.41.3) <B75B128C-7D7A-3318-91CD-82B5A69C5329> /usr/lib/system/libsystem_kernel.dylib
0x7fffe06b3000 - 0x7fffe06fafe7 libsystem_m.dylib (3121.4) <266DB92B-A86F-3691-80FB-1B26AD73CFF3> /usr/lib/system/libsystem_m.dylib
0x7fffe06fb000 - 0x7fffe0719ff7 libsystem_malloc.dylib (116.30.3) <F40DEE3B-386A-3529-A3F7-98117ED55BF4> /usr/lib/system/libsystem_malloc.dylib
0x7fffe071a000 - 0x7fffe0771ffb libsystem_network.dylib (856.30.16) <4AE368E9-605D-379D-B04C-2AC7455B8250> /usr/lib/system/libsystem_network.dylib
0x7fffe0772000 - 0x7fffe077bff3 libsystem_networkextension.dylib (563.30.15) <EB020B0C-7DF0-3EEF-8E3C-15DA3C01D687> /usr/lib/system/libsystem_networkextension.dylib
0x7fffe077c000 - 0x7fffe0785ff3 libsystem_notify.dylib (165.20.1) <E7FD3A7C-DD07-36E2-9FA4-7561F9F114DA> /usr/lib/system/libsystem_notify.dylib
0x7fffe0786000 - 0x7fffe078efe7 libsystem_platform.dylib (126.1.2) <3CA06D4E-C00A-36DE-AA65-3A390097D1F6> /usr/lib/system/libsystem_platform.dylib
0x7fffe078f000 - 0x7fffe0799ff7 libsystem_pthread.dylib (218.30.1) <C869ED7C-BE29-3532-8E69-3A8DA1447EDC> /usr/lib/system/libsystem_pthread.dylib
0x7fffe079a000 - 0x7fffe079dff7 libsystem_sandbox.dylib (592.31.1) <7BBFDF96-293F-3DD9-B3A4-7C168280B441> /usr/lib/system/libsystem_sandbox.dylib
0x7fffe079e000 - 0x7fffe079ffff libsystem_secinit.dylib (24) <5C1F1E47-0F7D-3E25-8DEB-D9DB1F902281> /usr/lib/system/libsystem_secinit.dylib
0x7fffe07a0000 - 0x7fffe07a7fff libsystem_symptoms.dylib (532.30.6) <5D990CF5-B58F-39F7-B375-99B4EC62CFBD> /usr/lib/system/libsystem_symptoms.dylib
0x7fffe07a8000 - 0x7fffe07c8ff7 libsystem_trace.dylib (518.30.7) <6D34D1EA-2A3C-3D2D-803E-A666E6AEEE52> /usr/lib/system/libsystem_trace.dylib
0x7fffe07c9000 - 0x7fffe07ceffb libunwind.dylib (35.3) <9F7C2AD8-A9A7-3DE4-828D-B0F0F166AAA0> /usr/lib/system/libunwind.dylib
0x7fffe07cf000 - 0x7fffe07f8ff7 libxpc.dylib (972.30.7) <65E41BB6-EBD5-3D93-B0BE-B190CEE4DD93> /usr/lib/system/libxpc.dylib

External Modification Summary:
Calls made by other processes targeting this process:
task_for_pid: 0
thread_create: 0
thread_set_state: 0
Calls made by this process:
task_for_pid: 0
thread_create: 0
thread_set_state: 0
Calls made by all processes on this machine:
task_for_pid: 3112
thread_create: 0
thread_set_state: 0

VM Region Summary:
ReadOnly portion of Libraries: Total=145.9M resident=0K(0%) swapped_out_or_unallocated=145.9M(100%)
Writable regions: Total=99.0M written=0K(0%) resident=0K(0%) swapped_out=0K(0%) unallocated=99.0M(100%)

VIRTUAL REGION
REGION TYPE SIZE COUNT (non-coalesced)
=========== ======= =======
Kernel Alloc Once 8K 2
MALLOC 78.2M 17
MALLOC guard page 16K 4
STACK GUARD 56.0M 2
Stack 8192K 2
VM_ALLOCATE 12.3M 19
__DATA 5300K 112
__LINKEDIT 114.3M 43
__TEXT 31.6M 107
__UNICODE 556K 2
shared memory 12K 4
=========== ======= =======
TOTAL 306.1M 303

Model: MacPro6,1, BootROM MP61.0116.B21, 4 processors, Quad-Core Intel Xeon E5, 3.7 GHz, 12 GB, SMC 2.20f18
Graphics: AMD FirePro D300, AMD FirePro D300, PCIe, 2048 MB
Graphics: AMD FirePro D300, AMD FirePro D300, PCIe, 2048 MB
Memory Module: DIMM1, 4 GB, DDR3 ECC, 1866 MHz, 0x80AD, 0x484D54343531553741465238432D52442020
Memory Module: DIMM2, 4 GB, DDR3 ECC, 1866 MHz, 0x80AD, 0x484D54343531553741465238432D52442020
Memory Module: DIMM3, 4 GB, DDR3 ECC, 1866 MHz, 0x80AD, 0x484D54343531553741465238432D52442020
AirPort: spairport_wireless_card_type_airport_extreme (0x14E4, 0x135), Broadcom BCM43xx 1.0 (7.21.171.68.1a5)
Bluetooth: Version 5.0.3f1, 3 services, 27 devices, 1 incoming serial ports
Network Service: Ethernet 2, Ethernet, en1
PCI Card: AMD FirePro D300, Display Controller, Slot-2
PCI Card: AMD FirePro D300, Display Controller, Slot-1
PCI Card: pci17d3,1214, RAID Controller, Thunderbolt@79,0,0
Serial ATA Device: APPLE SSD SM0256F, 251 GB
USB Device: USB 2.0 Bus
USB Device: Hub
USB Device: BRCM20702 Hub
USB Device: Bluetooth USB Host Controller
USB Device: USB 3.0 Bus
USB Device: Dell QuietKey Keyboard
USB Device: USB Optical Mouse
USB Device: APC AP5631
Thunderbolt Bus: Mac Pro, Apple Inc., 19.2
Thunderbolt Device: ARC5028-T2, Areca, 1, 25.1
Thunderbolt Bus: Mac Pro, Apple Inc., 19.2
Thunderbolt Bus: Mac Pro, Apple Inc., 19.2


Thanks in advance for any help you can provide. Let me know if there is any other information I can provide that may be of assistance.
MarkUNSW
 
Posts: 7
Joined: Wed Oct 29, 2014 2:10 am

Re: OMERO 2.7 install - BUILD FAILED

Postby jmoore » Wed Feb 08, 2017 10:17 am

Hi Mark,

MarkUNSW wrote:I'm receiving a perplexing python error
Python quit unexpectedly while using the Python plug-in.


Could you perhaps tell us a little more about what steps you've taken up to this point? For example, is Python installed via brew? (from https://www.openmicroscopy.org/site/support/omero5.2/sysadmins/unix/server-install-homebrew.html#requirements)

This sounds as if your installation of Ice wasn't built against the Python installation that's being used like in https://www.openmicroscopy.org/community/viewtopic.php?f=5&t=7353#p13092.

Cheers,
~Josh.
User avatar
jmoore
Team Member
 
Posts: 1300
Joined: Fri May 22, 2009 1:29 pm
Location: Germany

Re: OMERO 2.7 install - BUILD FAILED

Postby MarkUNSW » Thu Feb 09, 2017 7:36 pm

Yes Python was installed via Homebrew in accordance with the linked instructions.

I was actually receiving that same error you linked in viewtopic.php?f=5&t=7353#p13092 which led me to reinstall ice 3.5 via Homebrew (brew reinstall zeroc-ice35) that appeared to fix the issue and allow me to utilise the omero executable.
MarkUNSW
 
Posts: 7
Joined: Wed Oct 29, 2014 2:10 am

Re: OMERO 2.7 install - BUILD FAILED

Postby mtbc » Thu Feb 09, 2017 8:53 pm

Mark,

Great, we're glad it worked out! Thank you for letting us know of the good outcome.

Cheers,
Mark
User avatar
mtbc
Team Member
 
Posts: 77
Joined: Tue Oct 23, 2012 10:59 am
Location: Dundee, Scotland

Re: OMERO 2.7 install - BUILD FAILED

Postby MarkUNSW » Fri Feb 10, 2017 4:34 am

Apologies as my last post was perhaps less than clear. I am able to utilise the omero executable to perform functions such as <code>omero admin diagnostics</code> and <code>omero admin start</code> however when I execute <code>omero web start</code> I am still receiving the <quote>Python quit unexpectedly while using the Python plug-in.</quote> error.

Thanks,
Mark
MarkUNSW
 
Posts: 7
Joined: Wed Oct 29, 2014 2:10 am

Re: OMERO 2.7 install - BUILD FAILED

Postby jmoore » Fri Feb 10, 2017 11:59 am

Hi Mark,

sorry to hear you're still having issues. How much do you have installed in this instance of homebrew? Would it be possible to have out the packages which have been installed by the omero formula and start again? It's not clear to us if a sequence of commands might have caused zeroc to be re-installed without the required `--with-python` flag.

If possible, I'd propose removing zeroc and omero, and then retrying the instructions from the website. If you could capture the terminal output, then if you are still having issues after the install we can examine what options are being passed where and try to figure this out.

All the best,
~Josh
User avatar
jmoore
Team Member
 
Posts: 1300
Joined: Fri May 22, 2009 1:29 pm
Location: Germany


Return to Installation and Deployment

Who is online

Users browsing this forum: No registered users and 1 guest